{"text_format":"2","workbook":"xlsx","n_sheets":15,"sheets":["Nyugat","Kelet","SF","220+","Ryuku","KF","Létsíkok","Makrók","Egyéb labirintusok","Faji cuccok","adatok","Ősi és fattyas cuccok","Avatárok","Kihívás Tornya","Dragnitok"],"not_rendered":{"charts":0,"images":0,"macros":0,"external_links":0,"defined_names":6,"comments":0,"pivot_tables":0},"unopened":[],"bounds":{"document_bytes":16777216,"sheet_cells":100000,"run_cost":"one","rows_first":2000,"rows_last":500,"rows_between":2000,"halvings":0,"cell_chars":16384,"cell_head_chars":4096},"cells_cut":0,"cells_raw":0,"read":"whole","date_system":"1900"}

{"sheet":"Nyugat","index":0,"n_rows":102,"n_cols":10,"rows_kept":102,"cut":false,"hidden":false,"merged":[[94,5,98,5],[94,7,98,7],[94,6,98,6],[94,3,98,3],[94,1,98,1],[15,5,16,5],[1,1,3,1],[18,4,19,4],[1,4,3,4],[15,1,16,1],[15,3,16,3],[15,4,16,4],[32,2,34,2],[50,2,54,2],[50,3,54,3],[36,3,38,3],[18,1,19,1],[18,3,19,3],[71,9,72,9],[71,3,72,3],[71,4,72,4],[71,5,72,5],[71,7,72,7],[89,1,92,1],[89,6,92,6],[56,2,63,2],[66,1,67,1],[68,1,69,1],[65,4,69,4],[65,5,69,5],[89,7,92,7],[74,2,76,2],[74,3,76,3],[74,4,76,4],[74,6,76,6]]}
[]
[null,"Szürke mágustorony (500-506. épület)\n[15,19 - 15,49 - 15,79 - 15,109 - 15,34 - 15,64 - 15,94]","4 kaktusztüske (#114)","1 bordacsont (#16)","1. labirintus\n[20,13 - 26,47 - 22,77 - 29,107]"]
[null,null,"vagy","vagy"]
[null,null,"10 tüske (#22)","2 varányszem (#30)"]
[]
[null,"Tanya","3. labirintus","4. labirintus"]
[null,"(507. épület) [25,16]","[24,20]","[32,16]"]
[null,"(534. épület) [27,91]","[31,95]","[32,88]"]
[]
[null,"Kastély (528. épület) [26,23]","8. labirintus\n[23,19]","9. labirintus\n[22,29]","10. labirintus\n[32,22]"]
{"$rows_left_out":93}
{"sheet":"Kelet","index":1,"n_rows":52,"n_cols":13,"rows_kept":52,"cut":false,"hidden":false,"merged":[[49,4,51,4],[49,1,51,1],[49,2,51,2],[6,10,9,10],[6,6,9,6],[11,4,14,4],[11,6,14,6],[8,2,9,2],[6,2,7,2],[6,7,9,7],[6,8,9,8],[6,9,9,9],[16,1,18,1],[16,2,18,2],[16,3,18,3],[20,1,27,1],[1,2,4,2],[1,5,4,5],[1,6,4,6],[1,8,4,8],[1,9,4,9],[20,3,27,3],[20,5,27,5],[20,6,27,6],[20,7,27,7],[29,2,31,2],[29,3,31,3],[29,4,31,4],[29,6,31,6],[29,5,31,5],[16,8,18,8],[16,9,18,9],[16,10,18,10],[16,11,18,11],[16,12,18,12],[42,1,47,1],[42,2,47,2],[42,6,47,6],[42,9,47,9],[43,8,47,8],[33,1,35,1],[33,4,35,4],[33,6,35,6],[33,12,35,12],[33,9,35,9]]}
[]
[null,"Királyi palota","150 TVP építése\negy királyi emlékműbe","70. Labirintus","71. labirintus","Erdei bölcs\nküldetéssorozat\nteljesítése","95. Labirintus\n[198,28]","1 eknozol (#540)","Sir Argothius\nfelkeresése a \n98-as labirintusban\n(SF - Borzalom Fellegvára)","1 Techiulan amulettje (#499)"]
[null,"(Zangroz) (650. épület) [184,31]",null,"[169,29]","[151,66]",null,null,"1 iknegurin (#541)"]
[null,"(Alanor) (651. épület) [186,60]",null,"[170,58]","[159,41]",null,null,"1 mihlanil (#539)"]
[null,"(Roxat) (652. épület) [187,106]",null,"[167,105]","[148,100]"]
[]
[null,"Erdei bölcs","3 galachmit (#310)","74. Labirintus","75. Labirintus","76. Labirintus","77. Labirintus\n[169,7]","78. Labirintus\n[152,46]","79. Labirintus\n[211,99]","80. Labirintus\n[164,55]","94. Labirintus\n[193,12]"]
[null,"(666. épület) [182,27]",null,"[182,8]","[151,29]","[193,24]"]
[null,"(667. épület) [179,53]","1 zangrozi csizma (#451)","[149,50]","[169,63]","[187,71]"]
[null,"(668. épület) [189,101]",null,"[152,108]","[153,90]","[183,89]"]
{"$rows_left_out":43}
{"sheet":"SF","index":2,"n_rows":11,"n_cols":8,"rows_kept":11,"cut":false,"hidden":false,"merged":[[1,6,4,6],[1,7,4,7],[8,1,10,1],[8,4,10,4],[8,5,10,5],[1,2,4,2],[1,3,4,3],[1,4,4,4],[1,5,4,5]]}
[]
[null,"Borzalom fellegvára","24 mópat tetem (#584)","24 mutáns csont (#331)","1 gyémántkoponya (#644)","97. Labirintus\n[409,65]","98. Labirintus\n[409,65]","1 csillagrubin (#715)"]
[null,"(Északtűz) (671. épület) [311,11]"]
[null,"(Sárkányverem) (672. épület) [309,64]"]
[null,"(Lávafolyó) (673. épület) [312,117]"]
[]
[null,"Csontvár (756. épület) [401,94]","185. Labirintus\n[408,97]","186. Labirintus\n[393,95]","188. Labirintus\n[396,99]"]
[]
[null,"Thargodan könyvtár (Sárkányverem) (768. épület) [308,65]","1 kru'agon származék (#791)","1 og'khor esszencia","197. Labirintus\n[316,71]","198. Labirintus\n[318,60]"]
[null,null,"1 ml'othag származék (#792)","1 krg'humán esszencia"]
{"$rows_left_out":2}
{"sheet":"220+","index":3,"n_rows":23,"n_cols":12,"rows_kept":23,"cut":false,"hidden":false,"merged":[[3,1,4,1],[3,6,4,6],[3,4,4,4],[3,3,4,3],[6,1,11,1],[6,3,11,3],[6,4,11,4],[6,5,11,5],[6,6,11,6],[17,1,20,1],[17,2,20,2],[17,3,20,3],[17,4,20,4],[17,5,20,5]]}
[]
[null,"Történelemkutató intézet (691. épület)\n[242,44]\n[227,51]","103. Labirintus\n[226,16]","1 sziklozug comb (#858)","104. Labirintus\n[254,29]","105. Labirintus\n[251,55]","1 memóriaelixír (#860)","106. Labirintus\n[233,10]"]
[]
[null,"Barbár barlang (692. épület)\n[228,76]\n[228,111]\n[257,86]","120 víz (#27)","107. Labirintus\n[254,73]","108. Labirintus\n[238,94]","2 hernyópete (#878)","109. Labirintus\n[221,118]"]
[null,null,"15 kaja (#2)",null,null,"4 kitintüske (#879)"]
[]
[null,"Karbionális látomás (693. épület)\n[278,27]\n[289,16]\n[271,56]","3 parduanhályog (#909)","110. Labirintus\n[291,12]","111. Labirintus\n[270,57]","1 enkala deréköv (#915)","112. Labirintus\n[283,22]"]
[null,null,"13 pirkit (#153)"]
[null,null,"2 szürke briliáns (#908)"]
[null,null,"1 gyémántplazma (#910)"]
{"$rows_left_out":14}
{"sheet":"Ryuku","index":4,"n_rows":50,"n_cols":10,"rows_kept":50,"cut":false,"hidden":false,"merged":[[20,5,27,5],[3,8,9,8],[11,1,14,1],[11,4,14,4],[11,6,14,6],[3,1,9,1],[3,3,9,3],[3,5,9,5],[3,6,9,6],[3,7,9,7],[16,1,18,1],[16,3,18,3],[16,4,18,4],[20,1,27,1],[20,3,27,3],[29,1,31,1],[29,2,31,2],[29,4,31,4],[29,7,31,7],[35,1,41,1],[35,2,41,2],[35,4,41,4],[35,6,41,6],[35,7,41,7],[35,8,41,8],[35,9,41,9],[43,1,47,1],[43,2,47,2],[43,4,47,4],[43,5,47,5],[43,6,47,6],[43,7,47,7],[43,8,47,8]]}
[]
[null,"Hoarián falu (726. épület) [490,11]","6 ryuku ?????","5 teriád fétis (#1296)","142. labirintus\n[475,93]","143. labirintus\n[436,100]","6 hoarián szentírás (#1339)","1 hoarián sárkánybébi"]
[]
[null,"Nemesi palota (728. épület) [449,19]","KLD 5","144. labirintus\n[446,19]","20 korty galócapálinka (#1474)","146. labirintus\n[447,35]","145. labirintus\n[446,19]","147. labirintus\n[433,56]","1 Zarknod fülbevalója (#1304)"]
[null,null,"1 kithszaki orgyilkos",null,"8 édesmoha csomó (#1479)"]
[null,null,"90 TVP",null,"2 azuka vese (#1462)"]
[{"$nulls":4},"1 sárga gyöngy (#1392)"]
[{"$nulls":4},"2 tűzsárkány ital (#1400)"]
[{"$nulls":4},"6 pöfeteg tojás (#1386)"]
[{"$nulls":4},"30 gourry tojás (#1455)"]
{"$rows_left_out":41}
{"sheet":"KF","index":5,"n_rows":36,"n_cols":12,"rows_kept":36,"cut":false,"hidden":false,"merged":[[31,7,35,7],[31,8,35,8],[31,9,35,9],[31,10,35,10],[31,1,35,1],[31,3,35,3],[31,4,35,4],[31,5,35,5],[31,6,35,6],[8,9,10,9],[8,10,10,10],[21,6,28,6],[21,9,28,9],[21,10,28,10],[8,7,10,7],[21,11,28,11],[12,8,19,8],[12,2,19,2],[12,4,19,4],[12,5,19,5],[21,8,28,8],[21,5,28,5],[12,6,19,6],[12,7,19,7],[21,7,28,7],[1,8,6,8],[8,1,10,1],[8,2,10,2],[8,4,10,4],[8,5,10,5],[8,6,10,6],[8,8,10,8],[1,1,6,1],[1,2,6,2],[21,1,28,1],[21,3,28,3],[21,4,28,4],[12,1,19,1],[1,6,6,6]]}
[]
[null,"Sziránusz őrposzt (819. épület) [600,41]","200 nerub szemfog (#1871)","KLD 53 - [606,49]","KLD 54 - [606,49]","10 kővirág gyümölcs (#1956)","219. Labirintus\n[607,49]","1 varázsháló (#1882)","220. Labirintus\n[605,49]"]
[null,null,null,"Csata 2 random nerubbal","Nyomkövetés 249+","5 gyökérsarjadék (#1964)",null,"1 Kabazuka gyűrűje (#1898)"]
[null,null,null,"50 TVP","40 TVP","15 orchidea kehely (#1876)",null,"2 nerub elixír (#1966)"]
[{"$nulls":5},"5 mimózabimbó (#1878)"]
[{"$nulls":5},"30 pöfeteg spóra (#1901)"]
[{"$nulls":5},"5 tulipán gumó (#1903)"]
[]
[null,"Buborékpalota (820. épület) [589, 55]","Sziránusz őrposzt (#819)\nküldetéssorozat befejezése","40 yeti szív (#1070)","221. Labirintus\n[611,118]","222. Labirintus\n[513,110]","A küldetéssorozat innentől a\nTűzmágus barlangban (#821)\nfolytatódik","Visszatérni a\nTűzmágus barlangba (#821)","Addig járni a nerub településeket, ameddig meg nem kapod a 225. labirintus térképét","225. Labirintus\n[616,91]","226. Labirintus\n[608,83]"]
[null,null,null,"40 dűneelf arckendő (#1920)"]
{"$rows_left_out":27}
{"sheet":"Létsíkok","index":6,"n_rows":121,"n_cols":12,"rows_kept":121,"cut":false,"hidden":false,"merged":[[1,1,4,1],[1,3,4,3],[1,4,4,4],[1,5,4,5],[22,7,25,7],[31,1,35,1],[31,5,35,5],[31,6,35,6],[31,7,35,7],[22,1,29,1],[22,5,26,5],[22,3,25,3],[22,4,25,4],[31,4,35,4],[31,3,35,3],[31,2,35,2],[13,1,20,1],[13,3,16,3],[13,4,16,4],[13,5,17,5],[13,7,16,7],[6,1,10,1],[6,3,10,3],[6,4,10,4],[6,5,10,5],[62,4,65,4],[44,6,47,6],[53,6,57,6],[31,8,35,8],[1,8,4,8],[1,9,4,9],[1,10,4,10],[1,11,4,11],[1,6,4,6],[1,7,4,7],[6,7,10,7],[37,1,41,1],[37,3,41,3],[37,4,41,4],[53,10,56,10],[62,10,65,10],[62,7,65,7],[62,8,65,8],[62,9,66,9],[53,7,56,7],[53,8,56,8],[44,7,47,7],[44,8,47,8],[53,9,57,9],[37,5,41,5],[62,6,65,6],[44,1,51,1],[53,1,60,1],[62,1,66,1],[44,3,47,3],[44,4,47,4],[53,3,56,3],[53,4,56,4],[62,2,65,2],[62,3,65,3],[68,10,71,10],[68,11,71,11],[75,1,79,1],[81,1,85,1],[75,6,78,6],[81,6,84,6],[81,8,85,8],[81,11,84,11],[75,8,79,8],[75,11,78,11],[68,7,72,7],[68,8,72,8],[68,1,72,1],[68,3,72,3],[68,4,72,4],[68,5,72,5],[68,6,72,6],[68,9,72,9],[75,2,79,2],[75,3,79,3],[75,4,79,4],[75,5,79,5],[81,2,85,2],[81,3,85,3],[81,4,85,4],[81,5,85,5],[87,4,90,4],[87,5,90,5],[95,7,98,7],[95,1,99,1],[95,3,99,3],[95,4,99,4],[95,5,99,5],[95,6,98,6],[87,6,90,6],[87,7,90,7],[87,1,91,1],[117,1,121,1],[117,3,121,3],[117,4,121,4],[117,5,121,5],[117,6,121,6],[117,7,120,7],[117,8,120,8],[102,1,106,1],[110,1,114,1],[102,3,106,3],[102,4,106,4],[102,5,106,5],[110,3,114,3],[110,4,114,4],[110,5,114,5],[102,7,105,7],[110,7,113,7]]}
["A VÍZ LÉTSÍKJA"]
[null,"Sziránusz buborékház (841. épület)\n[649,20]","10 triton pikkely (#2243)","259. labirintus\n[654,32]","260. labirintus\n[644,19]","KLD 86\n200 TVP\nmin. felderítés : 200\n[649,20]","KLD 87\n100 TVP\nharc 2 fürge krabber ellen\n[662,6]","KLD 88\n100 TVP\nmin. úszás : 151\n[664,19]","KLD 89\n100 TVP\nmin. szörnyidomítás : 101\n[651,32]","KLD 90\n100 TVP\nszükséges: 1 memóriaserkentő\n[640,20]","261. labirintus\n[649,22]","65. Többszemélyes Kaland"]
[null,null,"10 szirén hajszál (#2250)"]
[]
[]
[]
[null,"Opati kalmár (843. épület)\n[647,33]","10 fekete gyöngy (#99)","KLD 91\n100 TVP\nmin. csapdakészítés : 60\n[662,6]","KLD 92\n100 TVP\n-\n[640,20]","KLD 93\n100 TVP\nharc 1 hullámsárkány ellen\nharc 1 Ishakar ellen\n[660,41]","1 hártyaköpeny (#2251)","262. labirintus\n[667,8]"]
[null,null,"10 quwarg igazgyöngy (#912)",null,null,null,"1 hártyakesztyű (#2252)"]
[null,null,"1 moa gyöngy (#378)",null,null,null,"1 hártyakarika (#2253)"]
[null,null,"1 sárga gyöngy (#1392)",null,null,null,"1 perpetuum (#2304)"]
{"$rows_left_out":112}
{"sheet":"Makrók","index":7,"n_rows":27,"n_cols":7,"rows_kept":27,"cut":false,"hidden":false,"merged":[[17,1,18,1]]}
[]
[null,"Tündérpalota (750. épület)","KLD 18","KLD 19","KLD 20","KLD 21","KLD 22"]
[null,"[104,62]","vizestömlő (#3)","aranytű (#272)","fejsze (#1240)","olló (#335)","-"]
[null,"[204,36]","300 TVP","200 TVP","250 TVP","300 TVP","200 TVP"]
[null,"[243,48]"]
[null,"[543,98]"]
[]
[null,"Tündérpalota (751. épület)","KLD 23","KLD 24","KLD 25","KLD 26","KLD 27"]
[null,"[164,62]","vizestömlő (#3)","aranytű (#272)","fejsze (#1240)","olló (#335)","-"]
[null,"[291,109]","300 TVP","200 TVP","250 TVP","300 TVP","200 TVP"]
{"$rows_left_out":18}
{"sheet":"Egyéb labirintusok","index":8,"n_rows":91,"n_cols":6,"rows_kept":91,"cut":false,"hidden":false,"merged":[]}
["##","Labirintus","Terület","koordináta","rövid leírás","Aktuális állapot"]
[21,"mínoszkúp","NY","random","orkok","nem ismert"]
[22,"mínoszkúp","NY","random","szörnykert","nem ismert"]
[23,"mínoszkúp","NY","random","varkaudar","nem ismert"]
[24,"mínoszkúp","NY","random","orkok","nem ismert"]
[25,"mínoszkúp","NY","random","csapdás","nem ismert"]
[26,"mínoszkúp","NY","random","szintszívó","nem ismert"]
[27,"mínoszkúp","NY","random","szintszívó","nem ismert"]
[28,"mínoszkúp","NY","random","orkok","nem ismert"]
[29,"mínoszkúp","NY","random","trollfás rövid","nem ismert"]
{"$rows_left_out":82}
{"sheet":"Faji cuccok","index":9,"n_rows":16,"n_cols":13,"rows_kept":16,"cut":false,"hidden":false,"merged":[[5,3,5,4],[5,5,5,6],[5,7,5,8],[5,9,5,10]]}
[]
[null,"Válaszd ki a fajodat :",null,null,"kobudera"]
[]
[null,null,null,"Hogy elkészíttesd szükséged lesz"]
[]
[null,null,null,"Bo'adhun fétis",null,"Kyorg relikvia",null,"Árnytünde tekercs",null,"Esthar drágakő"]
["páncél",{"$f":"LOOKUP(2,1/(adatok!$A$1:$A$84=$E$2)/(adatok!$B$1:$B$84=$A7),adatok!$C$1:$C$84)","v":"1045."},{"$f":"LOOKUP(2,1/(adatok!$A$1:$A$84=$E$2)/(adatok!$B$1:$B$84=$A7),adatok!$D$1:$D$84)","v":"yiang mellény"},{"$f":"LOOKUP(2,1/(adatok!$A$1:$A$84=$E$2)/(adatok!$B$1:$B$84=$A7),adatok!$E$1:$E$84)","v":757},{"$f":"LOOKUP(2,1/(adatok!$A$1:$A$84=$E$2)/(adatok!$B$1:$B$84=$A7),adatok!$F$1:$F$84)","v":"bo'adhun aranygömb"},{"$f":"LOOKUP(2,1/(adatok!$A$1:$A$84=$E$2)/(adatok!$B$1:$B$84=$A7),adatok!$G$1:$G$84)","v":772},{"$f":"LOOKUP(2,1/(adatok!$A$1:$A$84=$E$2)/(adatok!$B$1:$B$84=$A7),adatok!$H$1:$H$84)","v":"nagymesteri pálca"},{"$f":"LOOKUP(2,1/(adatok!$A$1:$A$84=$E$2)/(adatok!$B$1:$B$84=$A7),adatok!$I$1:$I$84)","v":777},{"$f":"LOOKUP(2,1/(adatok!$A$1:$A$84=$E$2)/(adatok!$B$1:$B$84=$A7),adatok!$J$1:$J$84)","v":"Arx tekercs"},{"$f":"LOOKUP(2,1/(adatok!$A$1:$A$84=$E$2)/(adatok!$B$1:$B$84=$A7),adatok!$K$1:$K$84)","v":747},{"$f":"LOOKUP(2,1/(adatok!$A$1:$A$84=$E$2)/(adatok!$B$1:$B$84=$A7),adatok!$L$1:$L$84)","v":"natharion opál"},"--->",{"$f":"\"KT   \"&D7&\"   \"&F7&\"   \"&H7","v":"KT   757   772   777"}]
["sisak",{"$f":"LOOKUP(2,1/(adatok!$A$1:$A$84=$E$2)/(adatok!$B$1:$B$84=$A8),adatok!$C$1:$C$84)","v":"1046."},{"$f":"LOOKUP(2,1/(adatok!$A$1:$A$84=$E$2)/(adatok!$B$1:$B$84=$A8),adatok!$D$1:$D$84)","v":"yiang sapka"},{"$f":"LOOKUP(2,1/(adatok!$A$1:$A$84=$E$2)/(adatok!$B$1:$B$84=$A8),adatok!$E$1:$E$84)","v":759},{"$f":"LOOKUP(2,1/(adatok!$A$1:$A$84=$E$2)/(adatok!$B$1:$B$84=$A8),adatok!$F$1:$F$84)","v":"ezüstlevél"},{"$f":"LOOKUP(2,1/(adatok!$A$1:$A$84=$E$2)/(adatok!$B$1:$B$84=$A8),adatok!$G$1:$G$84)","v":773},{"$f":"LOOKUP(2,1/(adatok!$A$1:$A$84=$E$2)/(adatok!$B$1:$B$84=$A8),adatok!$H$1:$H$84)","v":"drakolder póráz"},{"$f":"LOOKUP(2,1/(adatok!$A$1:$A$84=$E$2)/(adatok!$B$1:$B$84=$A8),adatok!$I$1:$I$84)","v":778},{"$f":"LOOKUP(2,1/(adatok!$A$1:$A$84=$E$2)/(adatok!$B$1:$B$84=$A8),adatok!$J$1:$J$84)","v":"Bev tekercs"},{"$f":"LOOKUP(2,1/(adatok!$A$1:$A$84=$E$2)/(adatok!$B$1:$B$84=$A8),adatok!$K$1:$K$84)","v":747},{"$f":"LOOKUP(2,1/(adatok!$A$1:$A$84=$E$2)/(adatok!$B$1:$B$84=$A8),adatok!$L$1:$L$84)","v":"natharion opál"},"--->",{"$f":"\"KT   \"&D8&\"   \"&F8&\"   \"&H8","v":"KT   759   773   778"}]
["pajzs",{"$f":"LOOKUP(2,1/(adatok!$A$1:$A$84=$E$2)/(adatok!$B$1:$B$84=$A9),adatok!$C$1:$C$84)","v":"1047."},{"$f":"LOOKUP(2,1/(adatok!$A$1:$A$84=$E$2)/(adatok!$B$1:$B$84=$A9),adatok!$D$1:$D$84)","v":"yiang hárítópajzs"},{"$f":"LOOKUP(2,1/(adatok!$A$1:$A$84=$E$2)/(adatok!$B$1:$B$84=$A9),adatok!$E$1:$E$84)","v":763},{"$f":"LOOKUP(2,1/(adatok!$A$1:$A$84=$E$2)/(adatok!$B$1:$B$84=$A9),adatok!$F$1:$F$84)","v":"ro'galhal lánc"},{"$f":"LOOKUP(2,1/(adatok!$A$1:$A$84=$E$2)/(adatok!$B$1:$B$84=$A9),adatok!$G$1:$G$84)","v":767},{"$f":"LOOKUP(2,1/(adatok!$A$1:$A$84=$E$2)/(adatok!$B$1:$B$84=$A9),adatok!$H$1:$H$84)","v":"kyorg rúnakorong"},{"$f":"LOOKUP(2,1/(adatok!$A$1:$A$84=$E$2)/(adatok!$B$1:$B$84=$A9),adatok!$I$1:$I$84)","v":779},{"$f":"LOOKUP(2,1/(adatok!$A$1:$A$84=$E$2)/(adatok!$B$1:$B$84=$A9),adatok!$J$1:$J$84)","v":"Cru tekercs"},{"$f":"LOOKUP(2,1/(adatok!$A$1:$A$84=$E$2)/(adatok!$B$1:$B$84=$A9),adatok!$K$1:$K$84)","v":747},{"$f":"LOOKUP(2,1/(adatok!$A$1:$A$84=$E$2)/(adatok!$B$1:$B$84=$A9),adatok!$L$1:$L$84)","v":"natharion opál"},"--->","KT   763   767   779"]
["kesztyű",{"$f":"LOOKUP(2,1/(adatok!$A$1:$A$84=$E$2)/(adatok!$B$1:$B$84=$A10),adatok!$C$1:$C$84)","v":"1048."},{"$f":"LOOKUP(2,1/(adatok!$A$1:$A$84=$E$2)/(adatok!$B$1:$B$84=$A10),adatok!$D$1:$D$84)","v":"yiang kesztyű"},{"$f":"LOOKUP(2,1/(adatok!$A$1:$A$84=$E$2)/(adatok!$B$1:$B$84=$A10),adatok!$E$1:$E$84)","v":758},{"$f":"LOOKUP(2,1/(adatok!$A$1:$A$84=$E$2)/(adatok!$B$1:$B$84=$A10),adatok!$F$1:$F$84)","v":"gyémánt fétisrúd"},{"$f":"LOOKUP(2,1/(adatok!$A$1:$A$84=$E$2)/(adatok!$B$1:$B$84=$A10),adatok!$G$1:$G$84)","v":768},{"$f":"LOOKUP(2,1/(adatok!$A$1:$A$84=$E$2)/(adatok!$B$1:$B$84=$A10),adatok!$H$1:$H$84)","v":"raskhiir bozaka"},{"$f":"LOOKUP(2,1/(adatok!$A$1:$A$84=$E$2)/(adatok!$B$1:$B$84=$A10),adatok!$I$1:$I$84)","v":780},{"$f":"LOOKUP(2,1/(adatok!$A$1:$A$84=$E$2)/(adatok!$B$1:$B$84=$A10),adatok!$J$1:$J$84)","v":"Gór tekercs"},{"$f":"LOOKUP(2,1/(adatok!$A$1:$A$84=$E$2)/(adatok!$B$1:$B$84=$A10),adatok!$K$1:$K$84)","v":747},{"$f":"LOOKUP(2,1/(adatok!$A$1:$A$84=$E$2)/(adatok!$B$1:$B$84=$A10),adatok!$L$1:$L$84)","v":"natharion opál"},"--->","KT   758   768   780"]
{"$rows_left_out":7}
{"sheet":"adatok","index":10,"n_rows":95,"n_cols":12,"rows_kept":95,"cut":false,"hidden":true,"merged":[[0,4,0,5],[0,6,0,7],[0,8,0,9],[0,10,0,11]]}
["faj",null,"ssz.","név","Bo'adhun fétis",null,"Kyorg relikvia",null,"Árnytünde tekercs",null,"Esthar drágakő"]
["ember","páncél","982.","mahagóni vért",761,"bronz nyakörv",769,"trakuun napkorong",777,"Arx tekercs",750,"türkíz karika"]
["ember","sisak","983.","mahagóni korona",758,"gyémánt fétisrúd",775,"bűvölt kristály",778,"Bev tekercs",750,"türkíz karika"]
["ember","pajzs","984.","mahagóni pajzs",760,"to'aghan orrkarika",773,"drakolder póráz",779,"Cru tekercs",750,"türkíz karika"]
["ember","kesztyű","985.","mahagóni kesztyű",760,"to'aghan orrkarika",772,"nagymesteri pálca",780,"Gór tekercs",750,"türkíz karika"]
["ember","csizma","986.","mahagóni csizma",759,"ezüstlevél",776,"arany foggyűrű",781,"Hro tekercs",750,"türkíz karika"]
["ember","köpeny","987.","mahagóni köpeny",762,"adamantit érme",770,"kyorg lepel",782,"Iti tekercs",750,"türkíz karika"]
["ember","vállvédő","988.","mahagóni vállvédő",763,"ro'galhal lánc",771,"idézőszőnyeg",783,"Jen tekercs",750,"türkíz karika"]
["ember","karvédő","989.","mahagóni karvédő",766,"aranyfétis",768,"raskhiir bozaka",785,"Lad tekercs",750,"türkíz karika"]
["ember","lábvédő","990.","mahagóni lábszárvédő",757,"bo'adhun aranygömb",774,"raskhiir talizmán",786,"Mul tekercs",750,"türkíz karika"]
{"$rows_left_out":86}
{"sheet":"Ősi és fattyas cuccok","index":11,"n_rows":51,"n_cols":14,"rows_kept":51,"cut":false,"hidden":false,"merged":[[2,2,2,6],[2,7,2,12],[24,2,24,8],[43,2,43,8],[43,9,43,10]]}
[null,"Éjfattyas tárgyak és komponenseik táblázata"]
[]
[null,null,"származékok",{"$nulls":4},"esszenciák",{"$nulls":5},"További komponens"]
["##","Név","ghraiton","kruagon","mlothag","rdalv","vgaxtol","ghraiton","kruagon","mlothag","rdalv","vgaxtol","dorka"]
[794,"Vg'axtol gyűrű","-","-",3,"-",3,"-","-","-","-","-","-","1 smaragd védőgyűrű"]
[795,"Gh'raiton fókusz",3,3,"-","-","-","-","-","-","-","-","-","1 arany papi karkötő"]
[796,"Rd'alv amulett",1,"-",1,2,"-","-","-","-","-","-","-","1 rubin fejék"]
[797,"Ml'othag abroncs",1,1,1,1,1,"-","-","-","-","-","-","1 bunthar bőr"]
[1064,"Tl'urlang konverter",4,4,4,4,4,"-","-","-","-","-","-","4 tl'urlang erőkő"]
[803,"Ősi karkötő","-","-","-",8,8,1,"-","-","-","-","-","-"]
{"$rows_left_out":42}
{"sheet":"Avatárok","index":12,"n_rows":9,"n_cols":14,"rows_kept":9,"cut":false,"hidden":false,"merged":[]}
["##","Név","Trezsör","Táj","Pozíció","Szint","Támadás","Max. ÉP","AC(sz,v,ü)","Sebzés","Sebezhetőség","Immunitás","Spec.","Varázslat"]
[7099,"Virotac, a művész","Virotac gyűrűje",220,"264,49",60,145,4400,"220-220-220",null,null,"tűz alapú varázslat nem hat rá\nméreg nem hat rá","Mentális támadás (4 ÉP-re esel)","fehér glóbusz\nnegatív csapás"]
[7100,"Lordac, a katona","Lordac kesztyűje","SF","422,17",70,150,6800,"235-235-215","1x60",0.7,null,"Itélkezik","fehér glóbusz\nistenítélet"]
[7101,"Arutac, az öreg","Arutac mithrilöve",220,"228,61",62,125,6000,"215-215-190","1x100",0.5,"hideg alapú varázslat nem hat rá",null,"fehér glóbusz"]
[7102,"Katrac, a kegyetlen","Katrac káoszkönyve",220,"262,120",66,125,5000,"220-220-220","1x100/4x5d25+60",null,"halál alapú varázslat nem hat rá","halálkiáltás/öregít","lángtenger"]
[7103,"Iniac, a csábító","Iniac nyaklánca","K (labi)","161,11",60,110,3000,"200-200-200","8x5d20+90",0.7,null,"Labirintusban van (melyet Katrac) legyőzése után kapsz meg, benne sok csapda (-6 támadás, vp szívó (1. szint 8-as pont)) illuzio (nehezen mentheto) vagy halalkiáltás","negatív csapás\npuha ütés"]
[7104,"Gotac, a szikla","Gotac sisakja","Ryuku","448,49",70,null,7000,"250-250-205","2x5d10+500",null,null,null,"nagyobb pajzszúzás"]
[7105,"Zortac, a szörny","Zortac méregfoga",220,"241,13",66,180,6701,"210-210-210","10x5d10+400",null,null,"gázt lehel","fekete energia"]
[7106,"Baurtac, a hatalmas","Baurtac kristálya","SF","312,65",60,160,3600,"216-216-216","1x6d25+120",null,"tűz alapú varázslat nem hat rá\nenergia alapú varázslat nem hat rá\nméreg nem hat rá",null,"manarobbantás\nistenítélet\nenergiacsóva\nfekete energia"]

{"sheet":"Kihívás Tornya","index":13,"n_rows":9,"n_cols":3,"rows_kept":9,"cut":false,"hidden":false,"merged":[]}
["Kihívás Tornya",null,"fordulószám"]
["1. szint","teljesítve",188]
["2. szint","teljesítve",195]
["3. szint","teljesítve",419]
["4. szint"]
["5. szint","teljesítve",228]
["6. szint"]
["7. szint"]
["8. szint"]

{"sheet":"Dragnitok","index":14,"n_rows":33,"n_cols":17,"rows_kept":33,"cut":false,"hidden":false,"merged":[]}
["##","Tárgy neve","Tulajdnoság","Lelőhely","Fegyver","Pajzs","Páncél","Sisak","Köpeny","Vállvédő","Kesztyű","Öv","Nadrág","Csizma","Nyaklánc","Karkötő","Gyűrű"]
[1741,"rubin dragnit","+6 védettség, +6 támadás, +3 sebzés","39. TK - Draklenek ellenfele",null,"X","X","X"]
[1742,"quwarg dragnit","+5 maxÉP","Quwarg ikerboly (#1740)","X","X","X","X","X","X","X","X","X","X","X","X","X"]
[1743,"smaragd dragnit","+10 védettség, +10 támadás, +10 max. ép","40. TK - Ryuku követ palotája",null,"X","X","X",null,null,null,"X"]
[1744,"vörös dragnit","+5 védettség, +5 támadás","41. TK - Honvédő harc a tengerparton","X",{"$nulls":5},"X"]
[1745,"jég dragnit","+5 max. ép., +5 mentő tűz ellen","189. (NY) és 224. (KF) labirintus","X","X","X","X","X","X","X","X","X","X","X","X","X"]
[1748,"topáz dragnit","+3 sebzés","olimpiai nyeremény / olimpiai licit","X"]
[1803,"kristály dragnit","+15 sebzés ganüidek ellen","KT-vel gyártható","X","X","X","X",null,null,"X"]
[1886,"képlékeny dragnit","+10 IQ, 20 max. vp, -10 ellenfél mentőre","szinguláris szaggató (#7246)",null,null,null,"X"]
[1928,"tündöklő dragnit","+10 védettség, +10 szer., +10 max. ép","Rabu thin főbiztos (#7393)",null,"X",null,null,null,"X"]
{"$rows_left_out":23}